vihreä kemia
type: Concept
broader: kemia
in scheme: conceptscheme
preferred label: green chemistry @en
scope note: Tarkoittaa vaarallisten tai haitallisten aineiden käytön vähentämistä kemiallisissa tuotteissa tai prosesseissa

kemia
type: Concept
narrower: vihreä kemia
preferred label: kemi @sv
preferred label: chemistry @en