biotunnistus
type: Concept
source: Kielitoimiston sanakirja
comment: henkilöyden tunnistaminen sormenjäljen, silmän verkkokalvon, äänen tms. fyysisen ominaisuuden perusteella
alternative label: biometrinen tunnistus
alternative label: bioidentifiering @sv
broader: identifiointi
in scheme: conceptscheme
preferred label: bioidentification @en
preferred label: biometrisk identifiering @sv
related: puhujantunnistus

puhujantunnistus
type: Concept
preferred label: speaker recognition @en
related: biotunnistus

identifiointi
type: Concept
narrower: biotunnistus
preferred label: identifiering @sv
preferred label: identification @en