arbetskraftsförvaltning
type: Concept
broader: förvaltningsgrenar
in scheme: conceptscheme
preferred label: työvoimahallinto @fi
preferred label: labour administration @en
related: arbetsförvaltning
scope note: Benämningen på arbetsförvaltningen till år 1989
scope note: Työhallinnosta vuoteen 1989 käytetty nimitys

arbetsförvaltning
type: Concept
preferred label: labour administration @en
preferred label: työhallinto @fi
related: arbetskraftsförvaltning

förvaltningsgrenar
type: Concept
narrower: arbetskraftsförvaltning
preferred label: administrative branches @en
preferred label: hallinnonalat @fi