legal certainty
type: Concept
source: Kielitoimiston sanakirja
comment: oikeudellisten ratkaisujen ennakoitavuus, muodollinen oikeusturva; samanlaisten tapausten ratkaiseminen samalla tavoin, muodollinen lainmukaisuus
broader: technical-legal phenomena
in scheme: conceptscheme
preferred label: rättssäkerhet @sv
preferred label: oikeusvarmuus @fi
related: legal protection

technical-legal phenomena
type: Concept
narrower: legal certainty
preferred label: oikeustekniset ilmiöt @fi

legal protection
type: Concept
preferred label: rättsskydd @sv
preferred label: oikeusturva @fi
related: legal certainty