Kirkniemi manor
type: Concept
broader: manors
in scheme: conceptscheme
preferred label: Kirkniemi @fi
scope note: Kartano Lohjalla (aik. Lohjan kunnassa). Kylää tarkoitettaessa käytä Lohja -- Kirkniemi

manors
type: Concept
narrower: Kirkniemi manor
preferred label: herrgårdar @sv
preferred label: kartanot @fi