tung brännolja
type: Concept
preferred label: industrial fuel oil @en
preferred label: raskas polttoöljy @fi
related: tallolja

tallolja
type: Concept
source: www.motiva.fi
comment: Mäntyöljyä syntyy sulfaattisellun tuotannossa sivutuotteena. Mäntyöljy on peräisin saippuoituneesta uuteaineesta - ns. raakasuovasta - jota syntyy kun sellunkeiton jätelientä eli mustalipeää haihdutetaan. Raakamäntyöljystä voidaan tuottaa biodieseliä, joka soveltuu raskaan polttoöljyn korvikkeeksi. Mäntyöljystä valmistetulla biodieselillä on hyvä kylmänkestävyys ja juoksevuus. Mäntyöljyn lämpöarvo on n. 36,5-38,5 MJ/kg.
broader: vegetabiliska oljor
in scheme: conceptscheme
preferred label: mäntyöljy @fi
preferred label: pine oil @en
related: tung brännolja

vegetabiliska oljor
type: Concept
narrower: tallolja
preferred label: vegetable oils @en
preferred label: kasviöljyt @fi