toimintamuodot
type: Concept
source: Kielitoimiston sanakirja
comment: muoto: tavasta jolla jk toiminta, teko, ilmiö tms. (ulkonaisesti, käytännössä) ilmenee
broader: yhteiskunnalliset ilmiöt
in scheme: conceptscheme
preferred label: verksamhetsformer @sv
preferred label: lines of action @en
related: toimintamallit

yhteiskunnalliset ilmiöt
type: Concept
narrower: toimintamuodot
preferred label: societal phenomena @en

toimintamallit
type: Concept
preferred label: verksamhetsmodeller @sv
preferred label: operations models @en
related: toimintamuodot