Visavuori
type: Concept
broader: artists' homes
in scheme: conceptscheme
scope note: Kuvanveistäjä Emil Wikströmin taiteilijakoti Sääksmäellä

artists' homes
type: Concept
narrower: Visavuori
preferred label: konstnärshem @sv
preferred label: taiteilijakodit @fi