generation accounting
type: Concept
source: Lähde: Vanne, R., Julkinen talous ja sukupolvet
broader: bookkeeping
in scheme: conceptscheme
preferred label: generationsräkenskaper @sv
preferred label: sukupolvitilinpito @fi
scope note: Tarkoittaa menetelmää, jolla selvitetään sitä, ovatko nykyiset ja tulevat sukupolvet eri asemassa suhteessa julkiseen talouteen. Indikaattoreina ovat nettoverot koko sukupolven elinkaarelta. Nettoverot ovat sukupolven elinkaarensa aikana maksamien verojen ja sen saamien tulonsiirtojen ja julkisten palvelujen erotus

bookkeeping
type: Concept
narrower: generation accounting
preferred label: bokföring @sv
preferred label: kirjanpito @fi