Kuokkala manor
type: Concept
broader: manors
in scheme: conceptscheme
preferred label: Kuokkalan kartano @fi
scope note: Kartano ja muinaistaidekeskus Jyväskylässä

manors
type: Concept
narrower: Kuokkala manor
preferred label: herrgårdar @sv
preferred label: kartanot @fi