nursing schools
type: Concept
broader: occupational schools
in scheme: conceptscheme
preferred label: sairaanhoito-oppilaitokset @fi
preferred label: sjukvårdsläroanstalter @sv
related: health service colleges
scope note: Benämningen på hälsovårdsläroinrättningar fram till år 1987 @sv
scope note: Terveydenhuolto-oppilaitoksista vuoteen 1987 käytetty nimitys

health service colleges
type: Concept
preferred label: hälsovårdsläroinrättningar @sv
preferred label: terveydenhuolto-oppilaitokset @fi
related: nursing schools

occupational schools
type: Concept
narrower: nursing schools
preferred label: ammatilliset oppilaitokset @fi