yrken
type: Concept
narrower: ordningsövervakare
preferred label: occupations @en
preferred label: ammatit @fi

ordningsövervakare
type: Concept
broader: yrken
in scheme: conceptscheme
preferred label: patrol officers @en
preferred label: järjestyksenvalvojat @fi
related: ordningsmän
scope note: Termen togs i bruk år 1999, tidigare användes termen ordningsmän
scope note: Nimitys käytössä vuodesta 1999 lähtien, aiemmat katso järjestysmiehet

ordningsmän
type: Concept
preferred label: stewards @en
preferred label: järjestysmiehet @fi
related: ordningsövervakare