slaget vid Olhava
type: Concept
broader: strider
in scheme: conceptscheme
preferred label: Olhavan taistelu @fi
related: Lapplandskriget
scope note: Suomalaisten ja saksalaisten joukkojen välinen taistelu Iin Olhavassa 29.9.1944

Lapplandskriget
type: Concept
preferred label: Lapin sota @fi
preferred label: war of lapland @en
related: slaget vid Olhava

strider
type: Concept
narrower: slaget vid Olhava
preferred label: battles @en
preferred label: taistelut @fi