lärdomsgrader
type: Concept
narrower: agrologer
preferred label: degrees @en
preferred label: oppiarvot @fi

agrologer
type: Concept
source: Kielitoimiston sanakirja
comment: luonnonvara-alan ammattikorkeakoulututkinnon (aik. maatalousoppilaitoksessa opistotasoisen tutkinnon) suorittanut henkilö
broader: lärdomsgrader
in scheme: conceptscheme
preferred label: agrologists @en
preferred label: agrologit @fi