muuttuva
type: Concept
comment: käsite, jolla on aikasidonnaisia olennaisia piirteitä (tai osia), joiden muodostama kokonaisuus voi vaihdella ajassa; muuttuvien käsitteiden avulla voidaan kuvata pysyvien käsitteiden piirteiden arvojen muutoksia
broader: yso-käsitteet
in scheme: conceptscheme
narrower: prosessit
preferred label: perdurant @en
preferred label: föränderlig @sv

prosessit
type: Concept
broader: muuttuva
preferred label: processes @en
preferred label: processer @sv

yso-käsitteet
type: Concept
narrower: muuttuva