modern dans
type: Concept
narrower: modern dans
preferred label: comtemporary dance @en
preferred label: nykytanssi @fi

modern dans
type: Concept
broader: modern dans
in scheme: conceptscheme
preferred label: modern dance @en
preferred label: moderni tanssi @fi
scope note: moderni tanssi + nykytanssi = modern dans