miljöindikatorer
type: Concept
preferred label: ympäristöindikaattorit @fi
preferred label: environmental indicators @en
related: ekologiskt fotspår

ekologiskt fotspår
type: Concept
broader: mått
in scheme: conceptscheme
preferred label: ekologinen jalanjälki @fi
preferred label: ecological footprint @en
related: miljöindikatorer
scope note: Ekologisen jalanjäljen avulla voidaan arvioida missä mitassa luonnonvarojen käyttö ja päästöt vaikuttavat elolliseen luontoon. Se kertoo kuinka paljon ekologisesti tuottavaa maata eli viljelymaata, laidunta, metsää, rakennettua maata ja energiankulutuksen vaatimaa maa-alaa tarvitaan resurssien tuottamiseen ja samalla sulauttamaan takaisin luontoon päästöt ja jätteet. Mittaa ihmisen toiminnan vaikutusta elolliseen luontoon hehtaareina

mått
type: Concept
narrower: ekologiskt fotspår
preferred label: mitat (mittaustapa) @fi
preferred label: measures @en