mental phenomena
type: Concept
narrower: alexithymia
preferred label: mentaaliset ilmiöt @fi

alexithymia
type: Concept
source: Lähde: Lääketieteen termit
broader: mental phenomena
in scheme: conceptscheme
preferred label: aleksitymia @fi
related: emotional disorders
scope note: Tarkoittaa etenkin psykosomaattisista oireista kärsivillä potilailla esiintyvää häiriötä, jolle on ominaista vaikeus tunnistaa ja ilmaista tunteita sekä taipumus tunne-elämysten muuntumiseen fyysisiksi oireiksi

emotional disorders
type: Concept
preferred label: störningar i känslolivet @sv
preferred label: tunne-elämän häiriöt @fi
related: alexithymia