compositions
type: Concept
narrower: fugues
preferred label: kompositioner @sv
preferred label: sävellykset @fi

fugues
type: Concept
source: Kielitoimiston sanakirja
comment: mus. sävellys(tyyli) jossa aiheet kertautuvat eri äänissä
broader: compositions
in scheme: conceptscheme
preferred label: fugor @sv
preferred label: fuugat @fi