autoimmuunisairaudet
type: Concept
source: Lähde: Lääketieteen termit
alternative label: autoimmuunitaudit
broader: taudit
in scheme: conceptscheme
preferred label: auto-immune diseases @en
scope note: Sairaus, joka johtuu immuunivasteen kohdentumisesta kehon omiin antigeeneihin

taudit
type: Concept
narrower: autoimmuunisairaudet
preferred label: illnesses @en
preferred label: sjukdomar @sv