esteettömyys (käytön tai liikkumisen)
type: Concept
comment: käyttöön, liikkumiseen tms. liittyvä esteettömyys
alternative label: esteettömyys
broader: sisäiset ominaisuudet
in scheme: conceptscheme
preferred label: non-impediment @en
preferred label: hinderslöshet @sv

sisäiset ominaisuudet
type: Concept
narrower: esteettömyys (käytön tai liikkumisen)
preferred label: inre egenskaper @sv
preferred label: internal qualities @en