pakkotila
type: Concept
source: Kielitoimiston sanakirja
comment: tilanne jossa vaarasta selviäminen on mahdollista vain toisen etua t. oikeutta loukkaamalla
broader: yhteiskunnalliset ilmiöt
in scheme: conceptscheme
preferred label: nödsituation @sv
preferred label: state of necessity @en
related: itseapu

yhteiskunnalliset ilmiöt
type: Concept
narrower: pakkotila
preferred label: societal phenomena @en

itseapu
type: Concept
preferred label: självhjälp @sv
preferred label: self-help @en
related: pakkotila