perhekuntoutus
type: Concept
source: Lähde: Törrönen, H., Ehjänä perille
broader: kuntoutus
in scheme: conceptscheme
preferred label: familjerehabilitering @sv
preferred label: family rehabilitation @en
scope note: Sosiaali- ja terveystoimen työmenetelmä, jossa vanhemmat ja lapset ovat hoidon ja tuen piirissä yhdessä. Työskentely perheiden kanssa on sekä toiminnallista että keskusteluun pohjautuvaa

kuntoutus
type: Concept
narrower: perhekuntoutus
preferred label: rehabilitation @en
preferred label: rehabilitering @sv