Tutsi people
type: Concept
source: Kielitoimiston sanakirja
comment: eräs Burundissa ja Ruandassa elävä kansanryhmä
broader: africans
in scheme: conceptscheme
preferred label: tutsit @fi
preferred label: tutsier @sv

africans
type: Concept
narrower: Tutsi people
preferred label: afrikkalaiset @fi
preferred label: afrikaner @sv