yhdistäminen
type: Concept
comment: 1) kiinnittää esineet tms. toisiinsa, liittää, kytkeä 2) saattaa yhtenäiseksi kokonaisuudeksi 3) sijoittaa johonkin kokonaisuuteen tai yhteyteen, liittää, kytkeä, niveltää [Suomen kielen perussanakirja]
broader: toisenlaiseksi muuttaminen
in scheme: conceptscheme
preferred label: consolidation @en
preferred label: sammanförande @sv

toisenlaiseksi muuttaminen
type: Concept
narrower: yhdistäminen
preferred label: förvandling @sv
preferred label: alteration @en