Ylistalo
type: Concept
source: Lähde: Laajasalon Ylistalon historiaa
preferred label: Uppbyhus
broader: rälssitilat
in scheme: conceptscheme
scope note: Ylistalo on entinen rälssitila Helsingin Laajasalossa, ny- kyisin Laajasalo-Degerö-seuran kotiseututalo

rälssitilat
type: Concept
narrower: Ylistalo
preferred label: frälsehemman @sv
preferred label: freehold estates @en