yrittäjyys
type: Concept
narrower: luontoyrittäjyys
preferred label: enterprise @en
preferred label: entreprenörskap @sv

luontoyrittäjyys
type: Concept
alternative label: ekologinen yrittäjyys
broader: yrittäjyys
in scheme: conceptscheme
preferred label: nature entrepreneurship @en
related: ekoyrittäjyys
scope note: Tarkoittaa luonnonantimiin ja luonnon tarjoamiin elämyksiin perustuvaa ympäristövastuullista yrittäjyyttä. Luontoyrittäjyydessä painotetaan erityisesti luonnon aineettomia arvoja ja uusiutuvien luonnonvarojen käyttöä

ekoyrittäjyys
type: Concept
preferred label: ekologiskt entreprenörskap @sv
related: luontoyrittäjyys