metsätalousmaa
type: Concept
narrower: joutomaa
preferred label: skogsbruksmark @sv
preferred label: forestry land @en

joutomaa
type: Concept
source: Kielitoimiston sanakirja
comment: maatalous- ym. hyötykäyttöön kelpaamaton, jyvityksessä arvottomaksi katsottava maa
alternative label: ruderaattialueet
broader: metsätalousmaa
in scheme: conceptscheme
preferred label: uncultivable land @en
preferred label: impediment @sv