description of nature
type: Concept
broader: descriptions
in scheme: conceptscheme
preferred label: luonnonkuvaus @fi
preferred label: naturbeskrivning @sv
related: description of milieu
scope note: Används i samband med litteratur @sv
scope note: Käytetään kirjallisuuden yhteydessä. Valokuvauksen yhteydessä käytä luonnonvalokuvaus

description of milieu
type: Concept
preferred label: miljöökuvaus @fi
preferred label: miljöbeskrivning @sv
related: description of nature

descriptions
type: Concept
narrower: description of nature
preferred label: kuvaukset @fi