hazarat
type: Concept
source: Lähde: Hiltunen, S., Etninen sanasto ; Kaartinen, L., Talebaanien takana
alternative label: hasarat
broader: aasialaiset
in scheme: conceptscheme
preferred label: hazarer @sv
preferred label: Hazara people @en
scope note: Afganistanissa, Iranissa ja Pakistanissa asuvia muslimikansan jäseniä, 1200-1300-luvulla maahan hyökänneiden mongolien, turkkilaisten ja persialaisten valloittajien jälkeläisiä

aasialaiset
type: Concept
narrower: hazarat
preferred label: asians @en
preferred label: asiater @sv