johtaminen (suuntaaminen)
type: Concept
source: Kielitoimiston sanakirja
comment: ohjata tie, putki tms. menemään jstak, vetää; suunnata energia, ainevirta tms. jhk.
alternative label: johtamismenetelmät
alternative label: johtaminen
alternative label: johtamistaito
broader: liikuttaminen
broader: paikalleen laittava luonti
in scheme: conceptscheme
preferred label: leading @en
preferred label: ledande (riktande) @sv
scope note: Sanasto sisältää joitakin johtamismenetelmien nimiä; myös kaikkia muita voi käyttää asiasanoina

paikalleen laittava luonti
type: Concept
narrower: johtaminen (suuntaaminen)
preferred label: creation by placing @en
preferred label: placerande skapande @sv

liikuttaminen
type: Concept
narrower: johtaminen (suuntaaminen)
preferred label: causing to move @en
preferred label: rörelseframkallande @sv