centrifugalkraft
type: Concept
broader: kraft
in scheme: conceptscheme
preferred label: keskipakovoima @fi
preferred label: centrifugal force @en
related: centralkraft
scope note: Centrifugalkraft (från latinets centrum och fugere (undflyende)) är en term vilken kan referera till två olika krafter vilka är relaterade till rotation.

centralkraft
type: Concept
preferred label: central force @en
preferred label: keskeisvoima @fi
related: centrifugalkraft

kraft
type: Concept
narrower: centrifugalkraft
preferred label: force (physical properties) @en
preferred label: voima (fyysiset ominaisuudet) @fi