synthetism
type: Concept
source: http://www.nikkemedia.fi/ivailu/nettikurssit/taidehistoria1/symbolismi.html
comment: väripinnat olivat puhtaita, litteitä ja ääriviivoin korostettuja, samalla kun syvyysvaikutelma oli niukkaa tai täysin olematonta. Tyyli tunnetaan nimellä syntetismi.
broader: styles
in scheme: conceptscheme
preferred label: syntetism @sv
preferred label: syntetismi @fi

styles
type: Concept
narrower: synthetism
preferred label: tyylit @fi
preferred label: stilar @sv