uppfödning och odling
type: Concept
narrower: skogsodling
preferred label: upbringing @en
preferred label: kasvatus (kasvien tai eläinten) @fi

skogsodling
type: Concept
broader: uppfödning och odling
in scheme: conceptscheme
preferred label: wood farming @en
preferred label: puunkasvatus @fi
scope note: metsänviljely + puunkasvatus = skogsodling