concerts
type: Concept
narrower: Total Balalaika Show
preferred label: konsertit @fi
preferred label: konserter @sv

Total Balalaika Show
type: Concept
broader: concerts
in scheme: conceptscheme
scope note: Puna-armeijan kuoron ja rockyhtye Leningrad Cowboysin yhteinen konsertti Senaatintorilla Helsingissä kesäkuussa 1993