eläimet -- täyttö
type: Concept
broader: täyttö
preferred label: animals -- taxidermy @en
preferred label: uppstoppning av djur @sv

täyttö
type: Concept
source: Suomen kielen perussanakirja
comment: 1) panna tai saattaa jotakin johonkin tilaan niin, että tila tulee täyde(mmä)ksi, täyteen a) vajauksen tm. puutoksen kattamisesta; b) täyttää eläimen nahka niin, että sen ruumiin muoto tulee samaksi kuin elävällä eläimellä; c) (ruok.) panna johonkin leivonnaiseen tm. ruoka-aineeseen täytteeksi jotkain toista ainetta; d) (lääk.) hampaan täyttäminen paikka-aineella; 2) tehdä jokin täydeksi määrällään, olemassaolollaan; 3) olla mitoiltaan, laajuudeltaan tm. ominaisuudeltaan jonkin mukainen, vastata jotakin; 4) ottaa, palkata tai asettaa joku johonkin virkaan, toimeen tai tehtävään; 5) saavuttaa täysinä vuosina (tai kuukausina) laskettava ikä; 6) toteuttaa, panna täytäntöön; 7) saattaa päätökseen, valmiiksi
alternative label: tillsättande @sv
alternative label: täyttäminen
broader: toisenlaiseksi muuttaminen
in scheme: conceptscheme
narrower: eläimet -- täyttö
preferred label: påfyllning @sv
preferred label: filling @en

toisenlaiseksi muuttaminen
type: Concept
narrower: täyttö
preferred label: förvandling @sv
preferred label: alteration @en