Ainola
type: Concept
broader: artists' homes
in scheme: conceptscheme
scope note: Säveltäjä Jean Sibeliuksen taiteilijakoti Järvenpäässä. Valtio osti Ainolan v. 1972, ja se avattiin museona v. 1974

artists' homes
type: Concept
narrower: Ainola
preferred label: konstnärshem @sv
preferred label: taiteilijakodit @fi