physiocracy
type: Concept
source: MOT Suomi 1.0a
comment: hist. 1700-luvun kansantalouden oppisuunta, jonka mukaan maatalous on vaurauden perusta ja valtion talouteen puuttuminen on rajoitettava mahdollisimman vähiin
broader: ideas
in scheme: conceptscheme
preferred label: fysiokrati @sv
preferred label: fysiokratia @fi
related: mercantilism

mercantilism
type: Concept
preferred label: merkantilism @sv
preferred label: merkantilismi @fi
related: physiocracy

ideas
type: Concept
narrower: physiocracy
preferred label: ideer @sv
preferred label: aatteet @fi