befordringar
type: Concept
preferred label: promotions @en
preferred label: ylennykset @fi
related: militära grader

ranks
type: Concept
narrower: militära grader
preferred label: arvoasteet @fi

militära grader
type: Concept
broader: ranks
in scheme: conceptscheme
preferred label: sotilasarvot @fi
preferred label: military ranks @en
related: befordringar
scope note: Sotilasarvojen nimiä voi käyttää asiasanoina, esim. kersantit
scope note: Namn på militära grader kan användas som ämnesord, t.ex. sergeanter.