kalk
type: Concept
source: Biologian sanakirja
comment: Kalkki on kalsiumin kansanomainen nimitys ja yleisnimi erilaisille kalsiumsuoloille.
broader: salter
in scheme: conceptscheme
preferred label: lime, mineral @en
preferred label: kalkki @fi
related: kalcium

kalcium
type: Concept
preferred label: calcium @en
preferred label: kalsium @fi
related: kalk

salter
type: Concept
narrower: kalk
preferred label: salts @en
preferred label: suolat @fi