valtionkirkko
type: Concept
source: Kielitoimiston sanakirja
comment: valtiosta hallinnollisesti ja taloudellisesti riippuvainen kirkkokunta
alternative label: valtiokirkko
broader: kirkko
in scheme: conceptscheme
preferred label: state church @en
preferred label: statskyrka @sv

kirkko
type: Concept
narrower: valtionkirkko
preferred label: church @en
preferred label: kyrkan @sv