kaivokset
type: Concept
broader: ihmisen määrittämä paikka
in scheme: conceptscheme
preferred label: gruvor @sv
preferred label: mines @en
related: louhokset
scope note: Olika gruvor indexeras enligt produktion; t.ex. gruvor : stenkol @sv
scope note: Eri kaivokset indeksoidaan tuotteensa mukaan esim. kaivokset -- kivihiili

louhokset
type: Concept
preferred label: quarries @en
preferred label: stenbrott @sv
related: kaivokset

ihmisen määrittämä paikka
type: Concept
narrower: kaivokset
preferred label: place defined by human @en