rasitteet
type: Concept
source: Kielitoimiston sanakirja
comment: oikeus käyttää toisen kiinteistön aluetta määrätarkoitukseen
broader: oikeustekniset ilmiöt
in scheme: conceptscheme
preferred label: servitut @sv
preferred label: easements @en

oikeustekniset ilmiöt
type: Concept
narrower: rasitteet
preferred label: technical-legal phenomena @en