värmeavfall
type: Concept
broader: miljöförorening
in scheme: conceptscheme
preferred label: lämpösaastuminen @fi
preferred label: heat pollution @en
scope note: Avser den uppvärmning kraftverken förorsakar på närmiljön
scope note: Tarkoittaa voimaloiden aiheuttamaa lähiympäristön lämpenemistä

miljöförorening
type: Concept
narrower: värmeavfall
preferred label: environmental pollution @en
preferred label: ympäristön saastuminen @fi