nuclides
type: Concept
source: Ydinvoimatekniikan sanasto
comment: atomilaji, jonka ytimessä on tietty lukumäärä protoneja ja neutroneja ja tietty energiatila ja jonka keskimääräinen elinikä kyseisessä tilassa on mitattavissa
broader: atoms
in scheme: conceptscheme
preferred label: nuklider @sv
preferred label: nuklidit @fi

atoms
type: Concept
narrower: nuclides
preferred label: atomer @sv
preferred label: atomit @fi