verkkokirjoittaminen
type: Concept
source: Lähde: Tietotekniikan termitalkoot
broader: kirjoittaminen
in scheme: conceptscheme
preferred label: nätskrivande @sv
preferred label: web writing @en
scope note: Tarkoittaa kirjoittamista, jossa tuotetaan tietoverkkoon sijoitettava teksti

kirjoittaminen
type: Concept
narrower: verkkokirjoittaminen
preferred label: writing @en
preferred label: skrivande @sv

kirjoittaminen julkaisupaikan mukaan
type: Collection
member: verkkokirjoittaminen