aine
type: Concept
narrower: komposiitit
preferred label: matter @en
preferred label: materia @sv

komposiitit
type: Concept
source: Muovitermit
comment: materiaali, joka koostuu kahdesta tai useammasta selvästi erottuvasta faasista, joista toinen, tavallisesti yhtenäinen faasi, on sideaineena ja toinen, esimerkiksi rakeinen tai kuitumainen, runkoaineena Komposiitit jaetaan massakomposiitteihin, jotka koostuvat eri materiaalien sekoitteesta (esim. talkkiseosteinen polypropeeni), ja kerroskomposiitteihin, jotka koostuvat erillisistä materiaalikerroksista (esim. lujitemuoviveneen runko).
broader: aine
in scheme: conceptscheme
preferred label: kompositer @sv
preferred label: composites @en

aine rakenteen mukaan
type: Collection
member: komposiitit