sick building syndrome
type: Concept
broader: illnesses
in scheme: conceptscheme
preferred label: sairas rakennus -oireyhtymä @fi
scope note: Tietyssä rakennuksessa (etenkin koneellisen ilmanvaihdon varassa olevassa toimistorakennuksessa, koulussa tai päiväkodissa) oleskelun jälkeen ilmenevät suhteellisen epämääräiset oireet , mm. väsymys, päänsärky sekä silmien ja kurkun kuivuminen

illnesses
type: Concept
narrower: sick building syndrome
preferred label: taudit @fi
preferred label: sjukdomar @sv