keskinäinen toiminta
type: Concept
narrower: alistus (vallan alaisuuteen)
preferred label: ömsesidig aktivitet @sv
preferred label: mutual activity @en

alistus (vallan alaisuuteen)
type: Concept
source: Kielitoimiston sanakirja
comment: saattaa jnk alaisuuteen, määräysvaltaan; lannistaa, kukistaa, nujertaa
alternative label: alistus
alternative label: alistaminen
alternative label: alistusmenettely
broader: keskinäinen toiminta
in scheme: conceptscheme
preferred label: underordning @sv
preferred label: reference @en