pääomanliikkeet
type: Concept
alternative label: pääomaliikkeet
broader: taloudelliset ilmiöt
in scheme: conceptscheme
preferred label: kapitalrörelser @sv
preferred label: capital movements @en
scope note: Ulkomaisten saatavien ja velkojen muutokset

taloudelliset ilmiöt
type: Concept
narrower: pääomanliikkeet
preferred label: economic phenomena @en